Compile Error
Compilation failed: 3 error(s), 0 warnings /w/foo.cs(1,0): error CS1525: Unexpected symbol `var' /w/foo.cs(31,7): error CS1012: Too many characters in character literal /w/foo.cs(35,7): error CS1012: Too many characters in character literal
[Hydro](https://hydro.ac)提供评测服务
信息
- 递交者
- 类型
- 递交
- 题目
- P1138 冗余依赖
- 语言
- C#
- 递交时间
- 2021-08-08 21:51:43
- 评测时间
- 2021-08-08 21:51:43
- 评测机
- 分数
- 0
- 总耗时
- 0ms
- 峰值内存
- 0 Bytes